{"text_format":"1","workbook":"xlsx","n_sheets":4,"sheets":["Console","Data In","Data Out","Settings"],"not_rendered":{"charts":5,"images":1,"macros":0,"external_links":0,"defined_names":9,"comments":0,"pivot_tables":0},"unopened":[],"bounds":{"document_bytes":16777216,"sheet_cells":100000,"rows_first":2000,"rows_last":500,"rows_between":2000,"halvings":0,"cell_chars":16384,"cell_head_chars":4096},"cells_cut":0,"cells_raw":0,"read":"whole","date_system":"1900"}

{"sheet":"Console","index":0,"n_rows":55,"n_cols":18,"rows_kept":55,"cut":false,"hidden":false,"merged":[[3,0,3,10]]}
[]
[]
[]
[null,null,null,null,null,null,null,null,null,null,null,"Pellet Velocity Ft/Sec","Average Velocity Ft/Sec","Min Velocity","Max Velocity","Pellet Deviation FPS","Power Ft/Pound","Average Power Ft/Pound"]
["X Range","Shot Number","Pellet Weight Grains","Velocity Ft/Sec","Ave Velocity","Min Velocity","Max Velocity","Pellet Deviation","Power Ft/Pound","Dev Last shot","Average Power Ft/Pound",{"$f":"Console!D6","v":""},{"$f":"Console!E6","v":""},{"$f":"Console!F6","v":""},{"$f":"Console!G6","v":""},{"$f":"Console!H6","v":""},{"$f":"Console!I6","v":""},{"$f":"Console!K6","v":""}]
[{"$f":"50-COUNTIF(B6:B55,\"\")","v":0},{"$f":"IF('Data In'!B8=\"\",\"\",'Data In'!B8)","v":""},{"$f":"IF('Data In'!C8=\"\",\"\",'Data In'!C8)","v":""},{"$f":"IF('Data In'!D8=\"\",\"\",'Data In'!D8)","v":""},{"$f":"IF('Data In'!E8=\"\",\"\",'Data In'!E8)","v":""},{"$f":"IF('Data In'!F8=\"\",\"\",'Data In'!F8)","v":""},{"$f":"IF('Data In'!G8=\"\",\"\",'Data In'!G8)","v":""},{"$f":"IF('Data In'!H8=\"\",\"\",'Data In'!H8)","v":""},{"$f":"IF('Data In'!B8=\"\",\"\",(C6*D6*D6)/450240)","v":""},{"$f":"IF('Data In'!B8=\"\",\"\",D6-D7)","v":""},{"$f":"IF('Data In'!I8=\"\",\"\",'Data In'!I8)","v":""}]
[{"$f":"50-COUNTIF(B7:B56,\"\")","v":0},{"$f":"IF('Data In'!B9=\"\",\"\",'Data In'!B9)","v":""},{"$f":"IF('Data In'!C9=\"\",\"\",'Data In'!C9)","v":""},{"$f":"IF('Data In'!D9=\"\",\"\",'Data In'!D9)","v":""},{"$f":"IF('Data In'!E9=\"\",\"\",'Data In'!E9)","v":""},{"$f":"IF('Data In'!F9=\"\",\"\",'Data In'!F9)","v":""},{"$f":"IF('Data In'!G9=\"\",\"\",'Data In'!G9)","v":""},{"$f":"IF('Data In'!H9=\"\",\"\",'Data In'!H9)","v":""},{"$f":"IF('Data In'!B9=\"\",\"\",(C7*D7*D7)/450240)","v":""},{"$f":"IF('Data In'!B9=\"\",\"\",D7-D8)","v":""},{"$f":"IF('Data In'!I9=\"\",\"\",'Data In'!I9)","v":""}]
[0,{"$f":"IF('Data In'!B10=\"\",\"\",'Data In'!B10)","v":""},{"$f":"IF('Data In'!C10=\"\",\"\",'Data In'!C10)","v":""},{"$f":"IF('Data In'!D10=\"\",\"\",'Data In'!D10)","v":""},{"$f":"IF('Data In'!E10=\"\",\"\",'Data In'!E10)","v":""},{"$f":"IF('Data In'!F10=\"\",\"\",'Data In'!F10)","v":""},{"$f":"IF('Data In'!G10=\"\",\"\",'Data In'!G10)","v":""},{"$f":"IF('Data In'!H10=\"\",\"\",'Data In'!H10)","v":""},{"$f":"IF('Data In'!B10=\"\",\"\",(C8*D8*D8)/450240)","v":""},{"$f":"IF('Data In'!B10=\"\",\"\",D8-D9)","v":""},{"$f":"IF('Data In'!I10=\"\",\"\",'Data In'!I10)","v":""}]
[0,{"$f":"IF('Data In'!B11=\"\",\"\",'Data In'!B11)","v":""},{"$f":"IF('Data In'!C11=\"\",\"\",'Data In'!C11)","v":""},{"$f":"IF('Data In'!D11=\"\",\"\",'Data In'!D11)","v":""},{"$f":"IF('Data In'!E11=\"\",\"\",'Data In'!E11)","v":""},{"$f":"IF('Data In'!F11=\"\",\"\",'Data In'!F11)","v":""},{"$f":"IF('Data In'!G11=\"\",\"\",'Data In'!G11)","v":""},{"$f":"IF('Data In'!H11=\"\",\"\",'Data In'!H11)","v":""},{"$f":"IF('Data In'!B11=\"\",\"\",(C9*D9*D9)/450240)","v":""},{"$f":"IF('Data In'!B11=\"\",\"\",D9-D10)","v":""},{"$f":"IF('Data In'!I11=\"\",\"\",'Data In'!I11)","v":""}]
[0,{"$f":"IF('Data In'!B12=\"\",\"\",'Data In'!B12)","v":""},{"$f":"IF('Data In'!C12=\"\",\"\",'Data In'!C12)","v":""},{"$f":"IF('Data In'!D12=\"\",\"\",'Data In'!D12)","v":""},{"$f":"IF('Data In'!E12=\"\",\"\",'Data In'!E12)","v":""},{"$f":"IF('Data In'!F12=\"\",\"\",'Data In'!F12)","v":""},{"$f":"IF('Data In'!G12=\"\",\"\",'Data In'!G12)","v":""},{"$f":"IF('Data In'!H12=\"\",\"\",'Data In'!H12)","v":""},{"$f":"IF('Data In'!B12=\"\",\"\",(C10*D10*D10)/450240)","v":""},{"$f":"IF('Data In'!B12=\"\",\"\",D10-D11)","v":""},{"$f":"IF('Data In'!I12=\"\",\"\",'Data In'!I12)","v":""}]
[0,{"$f":"IF('Data In'!B13=\"\",\"\",'Data In'!B13)","v":""},{"$f":"IF('Data In'!C13=\"\",\"\",'Data In'!C13)","v":""},{"$f":"IF('Data In'!D13=\"\",\"\",'Data In'!D13)","v":""},{"$f":"IF('Data In'!E13=\"\",\"\",'Data In'!E13)","v":""},{"$f":"IF('Data In'!F13=\"\",\"\",'Data In'!F13)","v":""},{"$f":"IF('Data In'!G13=\"\",\"\",'Data In'!G13)","v":""},{"$f":"IF('Data In'!H13=\"\",\"\",'Data In'!H13)","v":""},{"$f":"IF('Data In'!B13=\"\",\"\",(C11*D11*D11)/450240)","v":""},{"$f":"IF('Data In'!B13=\"\",\"\",D11-D12)","v":""},{"$f":"IF('Data In'!I13=\"\",\"\",'Data In'!I13)","v":""}]
[0,{"$f":"IF('Data In'!B14=\"\",\"\",'Data In'!B14)","v":""},{"$f":"IF('Data In'!C14=\"\",\"\",'Data In'!C14)","v":""},{"$f":"IF('Data In'!D14=\"\",\"\",'Data In'!D14)","v":""},{"$f":"IF('Data In'!E14=\"\",\"\",'Data In'!E14)","v":""},{"$f":"IF('Data In'!F14=\"\",\"\",'Data In'!F14)","v":""},{"$f":"IF('Data In'!G14=\"\",\"\",'Data In'!G14)","v":""},{"$f":"IF('Data In'!H14=\"\",\"\",'Data In'!H14)","v":""},{"$f":"IF('Data In'!B14=\"\",\"\",(C12*D12*D12)/450240)","v":""},{"$f":"IF('Data In'!B14=\"\",\"\",D12-D13)","v":""},{"$f":"IF('Data In'!I14=\"\",\"\",'Data In'!I14)","v":""}]
[0,{"$f":"IF('Data In'!B15=\"\",\"\",'Data In'!B15)","v":""},{"$f":"IF('Data In'!C15=\"\",\"\",'Data In'!C15)","v":""},{"$f":"IF('Data In'!D15=\"\",\"\",'Data In'!D15)","v":""},{"$f":"IF('Data In'!E15=\"\",\"\",'Data In'!E15)","v":""},{"$f":"IF('Data In'!F15=\"\",\"\",'Data In'!F15)","v":""},{"$f":"IF('Data In'!G15=\"\",\"\",'Data In'!G15)","v":""},{"$f":"IF('Data In'!H15=\"\",\"\",'Data In'!H15)","v":""},{"$f":"IF('Data In'!B15=\"\",\"\",(C13*D13*D13)/450240)","v":""},{"$f":"IF('Data In'!B15=\"\",\"\",D13-D14)","v":""},{"$f":"IF('Data In'!I15=\"\",\"\",'Data In'!I15)","v":""}]
[0,{"$f":"IF('Data In'!B16=\"\",\"\",'Data In'!B16)","v":""},{"$f":"IF('Data In'!C16=\"\",\"\",'Data In'!C16)","v":""},{"$f":"IF('Data In'!D16=\"\",\"\",'Data In'!D16)","v":""},{"$f":"IF('Data In'!E16=\"\",\"\",'Data In'!E16)","v":""},{"$f":"IF('Data In'!F16=\"\",\"\",'Data In'!F16)","v":""},{"$f":"IF('Data In'!G16=\"\",\"\",'Data In'!G16)","v":""},{"$f":"IF('Data In'!H16=\"\",\"\",'Data In'!H16)","v":""},{"$f":"IF('Data In'!B16=\"\",\"\",(C14*D14*D14)/450240)","v":""},{"$f":"IF('Data In'!B16=\"\",\"\",D14-D15)","v":""},{"$f":"IF('Data In'!I16=\"\",\"\",'Data In'!I16)","v":""}]
[0,{"$f":"IF('Data In'!B17=\"\",\"\",'Data In'!B17)","v":""},{"$f":"IF('Data In'!C17=\"\",\"\",'Data In'!C17)","v":""},{"$f":"IF('Data In'!D17=\"\",\"\",'Data In'!D17)","v":""},{"$f":"IF('Data In'!E17=\"\",\"\",'Data In'!E17)","v":""},{"$f":"IF('Data In'!F17=\"\",\"\",'Data In'!F17)","v":""},{"$f":"IF('Data In'!G17=\"\",\"\",'Data In'!G17)","v":""},{"$f":"IF('Data In'!H17=\"\",\"\",'Data In'!H17)","v":""},{"$f":"IF('Data In'!B17=\"\",\"\",(C15*D15*D15)/450240)","v":""},{"$f":"IF('Data In'!B17=\"\",\"\",D15-D16)","v":""},{"$f":"IF('Data In'!I17=\"\",\"\",'Data In'!I17)","v":""}]
[0,{"$f":"IF('Data In'!B18=\"\",\"\",'Data In'!B18)","v":""},{"$f":"IF('Data In'!C18=\"\",\"\",'Data In'!C18)","v":""},{"$f":"IF('Data In'!D18=\"\",\"\",'Data In'!D18)","v":""},{"$f":"IF('Data In'!E18=\"\",\"\",'Data In'!E18)","v":""},{"$f":"IF('Data In'!F18=\"\",\"\",'Data In'!F18)","v":""},{"$f":"IF('Data In'!G18=\"\",\"\",'Data In'!G18)","v":""},{"$f":"IF('Data In'!H18=\"\",\"\",'Data In'!H18)","v":""},{"$f":"IF('Data In'!B18=\"\",\"\",(C16*D16*D16)/450240)","v":""},{"$f":"IF('Data In'!B18=\"\",\"\",D16-D17)","v":""},{"$f":"IF('Data In'!I18=\"\",\"\",'Data In'!I18)","v":""}]
[0,{"$f":"IF('Data In'!B19=\"\",\"\",'Data In'!B19)","v":""},{"$f":"IF('Data In'!C19=\"\",\"\",'Data In'!C19)","v":""},{"$f":"IF('Data In'!D19=\"\",\"\",'Data In'!D19)","v":""},{"$f":"IF('Data In'!E19=\"\",\"\",'Data In'!E19)","v":""},{"$f":"IF('Data In'!F19=\"\",\"\",'Data In'!F19)","v":""},{"$f":"IF('Data In'!G19=\"\",\"\",'Data In'!G19)","v":""},{"$f":"IF('Data In'!H19=\"\",\"\",'Data In'!H19)","v":""},{"$f":"IF('Data In'!B19=\"\",\"\",(C17*D17*D17)/450240)","v":""},{"$f":"IF('Data In'!B19=\"\",\"\",D17-D18)","v":""},{"$f":"IF('Data In'!I19=\"\",\"\",'Data In'!I19)","v":""}]
[0,{"$f":"IF('Data In'!B20=\"\",\"\",'Data In'!B20)","v":""},{"$f":"IF('Data In'!C20=\"\",\"\",'Data In'!C20)","v":""},{"$f":"IF('Data In'!D20=\"\",\"\",'Data In'!D20)","v":""},{"$f":"IF('Data In'!E20=\"\",\"\",'Data In'!E20)","v":""},{"$f":"IF('Data In'!F20=\"\",\"\",'Data In'!F20)","v":""},{"$f":"IF('Data In'!G20=\"\",\"\",'Data In'!G20)","v":""},{"$f":"IF('Data In'!H20=\"\",\"\",'Data In'!H20)","v":""},{"$f":"IF('Data In'!B20=\"\",\"\",(C18*D18*D18)/450240)","v":""},{"$f":"IF('Data In'!B20=\"\",\"\",D18-D19)","v":""},{"$f":"IF('Data In'!I20=\"\",\"\",'Data In'!I20)","v":""}]
[0,{"$f":"IF('Data In'!B21=\"\",\"\",'Data In'!B21)","v":""},{"$f":"IF('Data In'!C21=\"\",\"\",'Data In'!C21)","v":""},{"$f":"IF('Data In'!D21=\"\",\"\",'Data In'!D21)","v":""},{"$f":"IF('Data In'!E21=\"\",\"\",'Data In'!E21)","v":""},{"$f":"IF('Data In'!F21=\"\",\"\",'Data In'!F21)","v":""},{"$f":"IF('Data In'!G21=\"\",\"\",'Data In'!G21)","v":""},{"$f":"IF('Data In'!H21=\"\",\"\",'Data In'!H21)","v":""},{"$f":"IF('Data In'!B21=\"\",\"\",(C19*D19*D19)/450240)","v":""},{"$f":"IF('Data In'!B21=\"\",\"\",D19-D20)","v":""},{"$f":"IF('Data In'!I21=\"\",\"\",'Data In'!I21)","v":""}]
[0,{"$f":"IF('Data In'!B22=\"\",\"\",'Data In'!B22)","v":""},{"$f":"IF('Data In'!C22=\"\",\"\",'Data In'!C22)","v":""},{"$f":"IF('Data In'!D22=\"\",\"\",'Data In'!D22)","v":""},{"$f":"IF('Data In'!E22=\"\",\"\",'Data In'!E22)","v":""},{"$f":"IF('Data In'!F22=\"\",\"\",'Data In'!F22)","v":""},{"$f":"IF('Data In'!G22=\"\",\"\",'Data In'!G22)","v":""},{"$f":"IF('Data In'!H22=\"\",\"\",'Data In'!H22)","v":""},{"$f":"IF('Data In'!B22=\"\",\"\",(C20*D20*D20)/450240)","v":""},{"$f":"IF('Data In'!B22=\"\",\"\",D20-D21)","v":""},{"$f":"IF('Data In'!I22=\"\",\"\",'Data In'!I22)","v":""}]
[0,{"$f":"IF('Data In'!B23=\"\",\"\",'Data In'!B23)","v":""},{"$f":"IF('Data In'!C23=\"\",\"\",'Data In'!C23)","v":""},{"$f":"IF('Data In'!D23=\"\",\"\",'Data In'!D23)","v":""},{"$f":"IF('Data In'!E23=\"\",\"\",'Data In'!E23)","v":""},{"$f":"IF('Data In'!F23=\"\",\"\",'Data In'!F23)","v":""},{"$f":"IF('Data In'!G23=\"\",\"\",'Data In'!G23)","v":""},{"$f":"IF('Data In'!H23=\"\",\"\",'Data In'!H23)","v":""},{"$f":"IF('Data In'!B23=\"\",\"\",(C21*D21*D21)/450240)","v":""},{"$f":"IF('Data In'!B23=\"\",\"\",D21-D22)","v":""},{"$f":"IF('Data In'!I23=\"\",\"\",'Data In'!I23)","v":""}]
[0,{"$f":"IF('Data In'!B24=\"\",\"\",'Data In'!B24)","v":""},{"$f":"IF('Data In'!C24=\"\",\"\",'Data In'!C24)","v":""},{"$f":"IF('Data In'!D24=\"\",\"\",'Data In'!D24)","v":""},{"$f":"IF('Data In'!E24=\"\",\"\",'Data In'!E24)","v":""},{"$f":"IF('Data In'!F24=\"\",\"\",'Data In'!F24)","v":""},{"$f":"IF('Data In'!G24=\"\",\"\",'Data In'!G24)","v":""},{"$f":"IF('Data In'!H24=\"\",\"\",'Data In'!H24)","v":""},{"$f":"IF('Data In'!B24=\"\",\"\",(C22*D22*D22)/450240)","v":""},{"$f":"IF('Data In'!B24=\"\",\"\",D22-D23)","v":""},{"$f":"IF('Data In'!I24=\"\",\"\",'Data In'!I24)","v":""}]
[0,{"$f":"IF('Data In'!B25=\"\",\"\",'Data In'!B25)","v":""},{"$f":"IF('Data In'!C25=\"\",\"\",'Data In'!C25)","v":""},{"$f":"IF('Data In'!D25=\"\",\"\",'Data In'!D25)","v":""},{"$f":"IF('Data In'!E25=\"\",\"\",'Data In'!E25)","v":""},{"$f":"IF('Data In'!F25=\"\",\"\",'Data In'!F25)","v":""},{"$f":"IF('Data In'!G25=\"\",\"\",'Data In'!G25)","v":""},{"$f":"IF('Data In'!H25=\"\",\"\",'Data In'!H25)","v":""},{"$f":"IF('Data In'!B25=\"\",\"\",(C23*D23*D23)/450240)","v":""},{"$f":"IF('Data In'!B25=\"\",\"\",D23-D24)","v":""},{"$f":"IF('Data In'!I25=\"\",\"\",'Data In'!I25)","v":""}]
[0,{"$f":"IF('Data In'!B26=\"\",\"\",'Data In'!B26)","v":""},{"$f":"IF('Data In'!C26=\"\",\"\",'Data In'!C26)","v":""},{"$f":"IF('Data In'!D26=\"\",\"\",'Data In'!D26)","v":""},{"$f":"IF('Data In'!E26=\"\",\"\",'Data In'!E26)","v":""},{"$f":"IF('Data In'!F26=\"\",\"\",'Data In'!F26)","v":""},{"$f":"IF('Data In'!G26=\"\",\"\",'Data In'!G26)","v":""},{"$f":"IF('Data In'!H26=\"\",\"\",'Data In'!H26)","v":""},{"$f":"IF('Data In'!B26=\"\",\"\",(C24*D24*D24)/450240)","v":""},{"$f":"IF('Data In'!B26=\"\",\"\",D24-D25)","v":""},{"$f":"IF('Data In'!I26=\"\",\"\",'Data In'!I26)","v":""}]
[0,{"$f":"IF('Data In'!B27=\"\",\"\",'Data In'!B27)","v":""},{"$f":"IF('Data In'!C27=\"\",\"\",'Data In'!C27)","v":""},{"$f":"IF('Data In'!D27=\"\",\"\",'Data In'!D27)","v":""},{"$f":"IF('Data In'!E27=\"\",\"\",'Data In'!E27)","v":""},{"$f":"IF('Data In'!F27=\"\",\"\",'Data In'!F27)","v":""},{"$f":"IF('Data In'!G27=\"\",\"\",'Data In'!G27)","v":""},{"$f":"IF('Data In'!H27=\"\",\"\",'Data In'!H27)","v":""},{"$f":"IF('Data In'!B27=\"\",\"\",(C25*D25*D25)/450240)","v":""},{"$f":"IF('Data In'!B27=\"\",\"\",D25-D26)","v":""},{"$f":"IF('Data In'!I27=\"\",\"\",'Data In'!I27)","v":""}]
[0,{"$f":"IF('Data In'!B28=\"\",\"\",'Data In'!B28)","v":""},{"$f":"IF('Data In'!C28=\"\",\"\",'Data In'!C28)","v":""},{"$f":"IF('Data In'!D28=\"\",\"\",'Data In'!D28)","v":""},{"$f":"IF('Data In'!E28=\"\",\"\",'Data In'!E28)","v":""},{"$f":"IF('Data In'!F28=\"\",\"\",'Data In'!F28)","v":""},{"$f":"IF('Data In'!G28=\"\",\"\",'Data In'!G28)","v":""},{"$f":"IF('Data In'!H28=\"\",\"\",'Data In'!H28)","v":""},{"$f":"IF('Data In'!B28=\"\",\"\",(C26*D26*D26)/450240)","v":""},{"$f":"IF('Data In'!B28=\"\",\"\",D26-D27)","v":""},{"$f":"IF('Data In'!I28=\"\",\"\",'Data In'!I28)","v":""}]
[0,{"$f":"IF('Data In'!B29=\"\",\"\",'Data In'!B29)","v":""},{"$f":"IF('Data In'!C29=\"\",\"\",'Data In'!C29)","v":""},{"$f":"IF('Data In'!D29=\"\",\"\",'Data In'!D29)","v":""},{"$f":"IF('Data In'!E29=\"\",\"\",'Data In'!E29)","v":""},{"$f":"IF('Data In'!F29=\"\",\"\",'Data In'!F29)","v":""},{"$f":"IF('Data In'!G29=\"\",\"\",'Data In'!G29)","v":""},{"$f":"IF('Data In'!H29=\"\",\"\",'Data In'!H29)","v":""},{"$f":"IF('Data In'!B29=\"\",\"\",(C27*D27*D27)/450240)","v":""},{"$f":"IF('Data In'!B29=\"\",\"\",D27-D28)","v":""},{"$f":"IF('Data In'!I29=\"\",\"\",'Data In'!I29)","v":""}]
[0,{"$f":"IF('Data In'!B30=\"\",\"\",'Data In'!B30)","v":""},{"$f":"IF('Data In'!C30=\"\",\"\",'Data In'!C30)","v":""},{"$f":"IF('Data In'!D30=\"\",\"\",'Data In'!D30)","v":""},{"$f":"IF('Data In'!E30=\"\",\"\",'Data In'!E30)","v":""},{"$f":"IF('Data In'!F30=\"\",\"\",'Data In'!F30)","v":""},{"$f":"IF('Data In'!G30=\"\",\"\",'Data In'!G30)","v":""},{"$f":"IF('Data In'!H30=\"\",\"\",'Data In'!H30)","v":""},{"$f":"IF('Data In'!B30=\"\",\"\",(C28*D28*D28)/450240)","v":""},{"$f":"IF('Data In'!B30=\"\",\"\",D28-D29)","v":""},{"$f":"IF('Data In'!I30=\"\",\"\",'Data In'!I30)","v":""}]
[0,{"$f":"IF('Data In'!B31=\"\",\"\",'Data In'!B31)","v":""},{"$f":"IF('Data In'!C31=\"\",\"\",'Data In'!C31)","v":""},{"$f":"IF('Data In'!D31=\"\",\"\",'Data In'!D31)","v":""},{"$f":"IF('Data In'!E31=\"\",\"\",'Data In'!E31)","v":""},{"$f":"IF('Data In'!F31=\"\",\"\",'Data In'!F31)","v":""},{"$f":"IF('Data In'!G31=\"\",\"\",'Data In'!G31)","v":""},{"$f":"IF('Data In'!H31=\"\",\"\",'Data In'!H31)","v":""},{"$f":"IF('Data In'!B31=\"\",\"\",(C29*D29*D29)/450240)","v":""},{"$f":"IF('Data In'!B31=\"\",\"\",D29-D30)","v":""},{"$f":"IF('Data In'!I31=\"\",\"\",'Data In'!I31)","v":""}]
[0,{"$f":"IF('Data In'!B32=\"\",\"\",'Data In'!B32)","v":""},{"$f":"IF('Data In'!C32=\"\",\"\",'Data In'!C32)","v":""},{"$f":"IF('Data In'!D32=\"\",\"\",'Data In'!D32)","v":""},{"$f":"IF('Data In'!E32=\"\",\"\",'Data In'!E32)","v":""},{"$f":"IF('Data In'!F32=\"\",\"\",'Data In'!F32)","v":""},{"$f":"IF('Data In'!G32=\"\",\"\",'Data In'!G32)","v":""},{"$f":"IF('Data In'!H32=\"\",\"\",'Data In'!H32)","v":""},{"$f":"IF('Data In'!B32=\"\",\"\",(C30*D30*D30)/450240)","v":""},{"$f":"IF('Data In'!B32=\"\",\"\",D30-D31)","v":""},{"$f":"IF('Data In'!I32=\"\",\"\",'Data In'!I32)","v":""}]
[0,{"$f":"IF('Data In'!B33=\"\",\"\",'Data In'!B33)","v":""},{"$f":"IF('Data In'!C33=\"\",\"\",'Data In'!C33)","v":""},{"$f":"IF('Data In'!D33=\"\",\"\",'Data In'!D33)","v":""},{"$f":"IF('Data In'!E33=\"\",\"\",'Data In'!E33)","v":""},{"$f":"IF('Data In'!F33=\"\",\"\",'Data In'!F33)","v":""},{"$f":"IF('Data In'!G33=\"\",\"\",'Data In'!G33)","v":""},{"$f":"IF('Data In'!H33=\"\",\"\",'Data In'!H33)","v":""},{"$f":"IF('Data In'!B33=\"\",\"\",(C31*D31*D31)/450240)","v":""},{"$f":"IF('Data In'!B33=\"\",\"\",D31-D32)","v":""},{"$f":"IF('Data In'!I33=\"\",\"\",'Data In'!I33)","v":""}]
[0,{"$f":"IF('Data In'!B34=\"\",\"\",'Data In'!B34)","v":""},{"$f":"IF('Data In'!C34=\"\",\"\",'Data In'!C34)","v":""},{"$f":"IF('Data In'!D34=\"\",\"\",'Data In'!D34)","v":""},{"$f":"IF('Data In'!E34=\"\",\"\",'Data In'!E34)","v":""},{"$f":"IF('Data In'!F34=\"\",\"\",'Data In'!F34)","v":""},{"$f":"IF('Data In'!G34=\"\",\"\",'Data In'!G34)","v":""},{"$f":"IF('Data In'!H34=\"\",\"\",'Data In'!H34)","v":""},{"$f":"IF('Data In'!B34=\"\",\"\",(C32*D32*D32)/450240)","v":""},{"$f":"IF('Data In'!B34=\"\",\"\",D32-D33)","v":""},{"$f":"IF('Data In'!I34=\"\",\"\",'Data In'!I34)","v":""}]
[0,{"$f":"IF('Data In'!B35=\"\",\"\",'Data In'!B35)","v":""},{"$f":"IF('Data In'!C35=\"\",\"\",'Data In'!C35)","v":""},{"$f":"IF('Data In'!D35=\"\",\"\",'Data In'!D35)","v":""},{"$f":"IF('Data In'!E35=\"\",\"\",'Data In'!E35)","v":""},{"$f":"IF('Data In'!F35=\"\",\"\",'Data In'!F35)","v":""},{"$f":"IF('Data In'!G35=\"\",\"\",'Data In'!G35)","v":""},{"$f":"IF('Data In'!H35=\"\",\"\",'Data In'!H35)","v":""},{"$f":"IF('Data In'!B35=\"\",\"\",(C33*D33*D33)/450240)","v":""},{"$f":"IF('Data In'!B35=\"\",\"\",D33-D34)","v":""},{"$f":"IF('Data In'!I35=\"\",\"\",'Data In'!I35)","v":""}]
[0,{"$f":"IF('Data In'!B36=\"\",\"\",'Data In'!B36)","v":""},{"$f":"IF('Data In'!C36=\"\",\"\",'Data In'!C36)","v":""},{"$f":"IF('Data In'!D36=\"\",\"\",'Data In'!D36)","v":""},{"$f":"IF('Data In'!E36=\"\",\"\",'Data In'!E36)","v":""},{"$f":"IF('Data In'!F36=\"\",\"\",'Data In'!F36)","v":""},{"$f":"IF('Data In'!G36=\"\",\"\",'Data In'!G36)","v":""},{"$f":"IF('Data In'!H36=\"\",\"\",'Data In'!H36)","v":""},{"$f":"IF('Data In'!B36=\"\",\"\",(C34*D34*D34)/450240)","v":""},{"$f":"IF('Data In'!B36=\"\",\"\",D34-D35)","v":""},{"$f":"IF('Data In'!I36=\"\",\"\",'Data In'!I36)","v":""}]
[0,{"$f":"IF('Data In'!B37=\"\",\"\",'Data In'!B37)","v":""},{"$f":"IF('Data In'!C37=\"\",\"\",'Data In'!C37)","v":""},{"$f":"IF('Data In'!D37=\"\",\"\",'Data In'!D37)","v":""},{"$f":"IF('Data In'!E37=\"\",\"\",'Data In'!E37)","v":""},{"$f":"IF('Data In'!F37=\"\",\"\",'Data In'!F37)","v":""},{"$f":"IF('Data In'!G37=\"\",\"\",'Data In'!G37)","v":""},{"$f":"IF('Data In'!H37=\"\",\"\",'Data In'!H37)","v":""},{"$f":"IF('Data In'!B37=\"\",\"\",(C35*D35*D35)/450240)","v":""},{"$f":"IF('Data In'!B37=\"\",\"\",D35-D36)","v":""},{"$f":"IF('Data In'!I37=\"\",\"\",'Data In'!I37)","v":""}]
[0,{"$f":"IF('Data In'!B38=\"\",\"\",'Data In'!B38)","v":""},{"$f":"IF('Data In'!C38=\"\",\"\",'Data In'!C38)","v":""},{"$f":"IF('Data In'!D38=\"\",\"\",'Data In'!D38)","v":""},{"$f":"IF('Data In'!E38=\"\",\"\",'Data In'!E38)","v":""},{"$f":"IF('Data In'!F38=\"\",\"\",'Data In'!F38)","v":""},{"$f":"IF('Data In'!G38=\"\",\"\",'Data In'!G38)","v":""},{"$f":"IF('Data In'!H38=\"\",\"\",'Data In'!H38)","v":""},{"$f":"IF('Data In'!B38=\"\",\"\",(C36*D36*D36)/450240)","v":""},{"$f":"IF('Data In'!B38=\"\",\"\",D36-D37)","v":""},{"$f":"IF('Data In'!I38=\"\",\"\",'Data In'!I38)","v":""}]
[0,{"$f":"IF('Data In'!B39=\"\",\"\",'Data In'!B39)","v":""},{"$f":"IF('Data In'!C39=\"\",\"\",'Data In'!C39)","v":""},{"$f":"IF('Data In'!D39=\"\",\"\",'Data In'!D39)","v":""},{"$f":"IF('Data In'!E39=\"\",\"\",'Data In'!E39)","v":""},{"$f":"IF('Data In'!F39=\"\",\"\",'Data In'!F39)","v":""},{"$f":"IF('Data In'!G39=\"\",\"\",'Data In'!G39)","v":""},{"$f":"IF('Data In'!H39=\"\",\"\",'Data In'!H39)","v":""},{"$f":"IF('Data In'!B39=\"\",\"\",(C37*D37*D37)/450240)","v":""},{"$f":"IF('Data In'!B39=\"\",\"\",D37-D38)","v":""},{"$f":"IF('Data In'!I39=\"\",\"\",'Data In'!I39)","v":""}]
[0,{"$f":"IF('Data In'!B40=\"\",\"\",'Data In'!B40)","v":""},{"$f":"IF('Data In'!C40=\"\",\"\",'Data In'!C40)","v":""},{"$f":"IF('Data In'!D40=\"\",\"\",'Data In'!D40)","v":""},{"$f":"IF('Data In'!E40=\"\",\"\",'Data In'!E40)","v":""},{"$f":"IF('Data In'!F40=\"\",\"\",'Data In'!F40)","v":""},{"$f":"IF('Data In'!G40=\"\",\"\",'Data In'!G40)","v":""},{"$f":"IF('Data In'!H40=\"\",\"\",'Data In'!H40)","v":""},{"$f":"IF('Data In'!B40=\"\",\"\",(C38*D38*D38)/450240)","v":""},{"$f":"IF('Data In'!B40=\"\",\"\",D38-D39)","v":""},{"$f":"IF('Data In'!I40=\"\",\"\",'Data In'!I40)","v":""}]
[0,{"$f":"IF('Data In'!B41=\"\",\"\",'Data In'!B41)","v":""},{"$f":"IF('Data In'!C41=\"\",\"\",'Data In'!C41)","v":""},{"$f":"IF('Data In'!D41=\"\",\"\",'Data In'!D41)","v":""},{"$f":"IF('Data In'!E41=\"\",\"\",'Data In'!E41)","v":""},{"$f":"IF('Data In'!F41=\"\",\"\",'Data In'!F41)","v":""},{"$f":"IF('Data In'!G41=\"\",\"\",'Data In'!G41)","v":""},{"$f":"IF('Data In'!H41=\"\",\"\",'Data In'!H41)","v":""},{"$f":"IF('Data In'!B41=\"\",\"\",(C39*D39*D39)/450240)","v":""},{"$f":"IF('Data In'!B41=\"\",\"\",D39-D40)","v":""},{"$f":"IF('Data In'!I41=\"\",\"\",'Data In'!I41)","v":""}]
[0,{"$f":"IF('Data In'!B42=\"\",\"\",'Data In'!B42)","v":""},{"$f":"IF('Data In'!C42=\"\",\"\",'Data In'!C42)","v":""},{"$f":"IF('Data In'!D42=\"\",\"\",'Data In'!D42)","v":""},{"$f":"IF('Data In'!E42=\"\",\"\",'Data In'!E42)","v":""},{"$f":"IF('Data In'!F42=\"\",\"\",'Data In'!F42)","v":""},{"$f":"IF('Data In'!G42=\"\",\"\",'Data In'!G42)","v":""},{"$f":"IF('Data In'!H42=\"\",\"\",'Data In'!H42)","v":""},{"$f":"IF('Data In'!B42=\"\",\"\",(C40*D40*D40)/450240)","v":""},{"$f":"IF('Data In'!B42=\"\",\"\",D40-D41)","v":""},{"$f":"IF('Data In'!I42=\"\",\"\",'Data In'!I42)","v":""}]
{"$rows_left_out":16}
{"sheet":"Data In","index":1,"n_rows":7,"n_cols":11,"rows_kept":7,"cut":false,"hidden":false,"merged":[[0,0,0,9],[1,0,1,9],[2,0,2,10],[5,0,5,10]]}
["Data In (From USB-SERIAL CH340 (COM4))"]
["Data coming from the current data source will appear below as it is received."]
["Current Data"]
["TIME","CH1","CH2","CH3","CH4","CH5","CH6","CH7","CH8","CH9","CH10"]
[]
["Historical Data"]
["TIME","CH1","CH2","CH3","CH4","CH5","CH6","CH7","CH8","CH9","CH10"]

{"sheet":"Data Out","index":2,"n_rows":4,"n_cols":10,"rows_kept":4,"cut":false,"hidden":false,"merged":[[0,0,0,7],[1,0,1,7]]}
["Data Out (To Device)"]
["Data entered into the channels below will be sent to the currently connected device as a comma-delimited string."]
[]
["CH1","CH2","CH3","CH4","CH5","CH6","CH7","CH8","CH9","CH10"]

{"sheet":"Settings","index":3,"n_rows":13,"n_cols":3,"rows_kept":13,"cut":false,"hidden":false,"merged":[[0,0,0,4],[1,0,1,4],[12,0,12,4]]}
["Workbook Settings"]
["Settings below will affect how data is read into the current workbook from data sources. Clear a field's contents to revert to its default setting."]
[]
["Data interval (ms)",150,150]
[]
["Data rows",15,50]
[]
["Data channels",10,10]
[]
["Data orientation","Newest last","Newest first"]
[]
[]
["WARNING: Changing settings may result in the loss of content and/or custom formatting in the Data In and Data Out worksheets. Always save before changing values."]